{"text_format":"1","workbook":"xlsx","n_sheets":4,"sheets":["Key data","Financing budget","Forwarding of funds","Example"],"not_rendered":{"charts":0,"images":0,"macros":0,"external_links":0,"defined_names":7,"comments":0,"pivot_tables":0},"unopened":[],"bounds":{"document_bytes":16777216,"sheet_cells":100000,"rows_first":2000,"rows_last":500,"rows_between":2000,"halvings":0,"cell_chars":16384,"cell_head_chars":4096},"cells_cut":0,"cells_raw":0,"read":"whole","date_system":"1900"}

{"sheet":"Key data","index":0,"n_rows":24,"n_cols":10,"rows_kept":24,"cut":false,"hidden":false,"merged":[[1,9,1,14],[23,2,23,6],[1,1,1,6],[3,2,3,6],[21,2,21,6],[5,2,5,4],[17,3,17,6],[18,3,18,6],[20,3,20,6],[19,3,19,6],[6,2,6,6],[8,4,8,6],[9,4,9,6],[7,2,7,6]]}
[null,"CONFIDENTIAL"]
[null,"Key data",null,null,null,null,null,null,null,"Instructions for the grant recipient:\nPlease start by entering the key data before proceeding to the ‘Financing budget” tab.\nPlease only enter information in the blue cells. All other cells will be calculated automatically."]
[]
[null,"Name of the grant recipient: ",null,null,null,null,null,{"$f":"IF(C4=\"Bitte eintragen\",\"- Bitte den Namen Ihres Vereins im Feld <Name des Zuschussempfängers> eintragen; \",\" \")","v":" "}]
[]
[null,"Is this the first budget \nor is an existing contract being modified?","First budget (no contract yet)",null,null,{"$f":"IF(C6=\"Modification to a contract\",\"How many times has the contract been modified?:\",\"\")","v":""},"Only select for modifications to a contract",{"$f":"IF(C6=\"Vertragsanpassung\",1,0)","v":0}]
[null,"Project title",null,null,null,null,null,{"$f":"IF(C7=\"Veranstaltung\",1,IF(C7=\"Projekt\",1,0))","v":0}]
[null,"Agreement number"]
[null,"Do you require administration costs?","Select","Please enter the administration costs as a percentage ",null,null,null,{"$f":"IF(C9=\"Ja, anderer Betrag\",1,0)","v":0}]
[null,"Are you providing a (financial) contribution of your own?","Select","Amount in EUR",null,null,null,{"$f":"IF(C10=\"Ja, anderer Betrag\",1,0)","v":0}]
[null,"How many donors will be co-financing the project (in addition to GIZ)?","Select","Name of the provider of third-party funding",null,"Amount of third-party funding in EUR"]
[null,null,null,"Name of the provider of third-party funding",null,"Amount of third-party funding in EUR",null,{"$f":"IF(C12=\"Ja\",1,0)","v":0}]
[null,null,null,"Name of the provider of third-party funding",null,"Amount of third-party funding in EUR",null,{"$f":"IF(C13=\"Ja\",1,0)","v":0}]
[null,null,null,"Name of the provider of third-party funding",null,"Amount of third-party funding in EUR"]
[null,null,null,"Name of the provider of third-party funding",null,"Amount of third-party funding in EUR"]
[null,null,null,"Name of the provider of third-party funding",null,"Amount of third-party funding in EUR"]
[null,null,null,"Name of the provider of third-party funding",null,"Amount of third-party funding in EUR"]
[null,"Will funds be forwarded to third-party recipients? (Please note, this does not relate to services) ","Select","This refers to third-party recipients that independently implement part of the recipient's project. A separate budget must be submitted and a commercial and legal eligibility check carried out by the GIZ project (needed criteria: legal entity and public-benefit nature). "]
[null,"Will medicines and/or pesticides and/or mineral fertilizers be procured?  ","Select","A separate internal GIZ approval process is needed."]
[null,"Will materials and equipment worth more than EUR 1,000,000 be procured or is more than 50% of the contract value earmarked for the procurement of materials and equipment for a contract worth at least EUR 400,000?","Select","A separate internal GIZ approval process is needed."]
{"$rows_left_out":5}
{"sheet":"Financing budget","index":1,"n_rows":180,"n_cols":15,"rows_kept":180,"cut":false,"hidden":false,"merged":[[4,14,4,23],[1,14,1,23],[1,0,1,8],[173,1,173,10],[171,1,171,7],[151,3,151,7],[5,1,5,7],[5,8,5,9],[6,9,150,9],[6,3,6,7],[44,3,44,7],[150,1,150,7],[133,3,133,7],[171,8,171,9],[154,3,154,7],[144,3,144,7],[119,3,119,7],[120,3,120,7],[121,3,121,7],[135,4,135,6],[136,4,136,6],[137,4,137,6],[134,4,134,6],[122,3,122,7],[82,3,82,7],[83,3,83,7],[84,3,84,7],[85,3,85,7],[86,3,86,7],[87,3,87,7],[2,0,2,9],[93,3,93,7],[179,1,179,9],[175,1,175,9],[74,3,74,7],[99,3,99,7],[116,3,116,7],[177,1,177,9],[176,1,176,9],[162,3,162,7],[123,3,123,7],[124,3,124,7],[125,3,125,7],[126,3,126,7],[127,3,127,7],[128,3,128,7],[129,3,129,7],[130,3,130,7],[108,3,108,7],[163,3,163,6],[164,3,164,6],[165,3,165,6],[166,3,166,6],[167,3,167,6],[168,3,168,6],[169,3,169,6],[170,3,170,6],[161,1,161,7],[160,3,160,7],[152,4,152,6],[153,1,153,7],[157,3,157,7],[158,3,158,7],[159,3,159,7],[138,4,138,6],[139,4,139,6],[140,4,140,6],[141,4,141,6],[142,4,142,6],[143,4,143,6],[109,3,109,7],[110,3,110,7],[45,3,45,7],[46,3,46,7],[47,3,47,7],[48,3,48,7],[49,3,49,7],[50,3,50,7],[51,3,51,7],[52,3,52,7],[53,3,53,7],[54,3,54,7],[55,3,55,7],[56,3,56,7],[57,3,57,7],[58,3,58,7],[59,3,59,7],[60,3,60,7],[61,3,61,7],[62,3,62,7],[63,3,63,7],[64,3,64,7],[65,3,65,7],[66,3,66,7],[67,3,67,7],[68,3,68,7],[69,3,69,7],[70,3,70,7],[71,3,71,7],[72,3,72,7],[73,3,73,7],[75,3,75,7],[76,3,76,7],[77,3,77,7],[78,3,78,7],[79,3,79,7],[80,3,80,7],[81,3,81,7],[88,3,88,7],[89,3,89,7],[90,3,90,7],[91,3,91,7],[92,3,92,7],[94,3,94,7],[95,3,95,7],[96,3,96,7],[97,3,97,7],[98,3,98,7],[100,3,100,7],[101,3,101,7],[102,3,102,7],[103,3,103,7],[104,3,104,7],[105,3,105,7],[106,3,106,7],[107,3,107,7],[145,3,145,7],[146,3,146,7],[147,3,147,7],[148,3,148,7],[149,3,149,7],[155,3,155,7],[156,3,156,7],[111,3,111,7],[112,3,112,7],[113,3,113,7],[114,3,114,7],[115,3,115,7],[117,3,117,7],[118,3,118,7],[131,3,131,7],[132,3,132,7]]}
[null,"CONFIDENTIAL"]
[{"$f":"IF('Key data'!C4=\"\",\"Please fill out the 'Key data' tab first (see below)\",CONCATENATE(\"Budget - Annex 1\",CHAR(10),'Key data'!C4,\" - \",'Key data'!C7,\"\",'Key data'!E7,\"\",IF(L6=\"VE\",CONCATENATE(\" - \",'Key data'!G6,\"SUPPLEMENT TO THE CONTRACT\",\"\"),\"\")))","v":"Please fill out the 'Key data' tab first (see below)"},null,null,null,null,null,null,null,null,{"$f":"'Key data'!C24","v":"00:00:00"},null,null,null,"no change","Instructions:\nPlease fill out the key data sheet before proceeding to the 'Financing budget’ tab.\nOn this ‘Financing budget’ tab, please only enter information in the blue cells. All other cells will be calculated automatically."]
[{"$f":"IF(NOT(ISBLANK('Key data'!C8)),CONCATENATE(\"Agreement number: \",'Key data'!C8),\"\")","v":""}]
[null,null,null,null,null,null,null,null,null,"2025-02",null,null,null,"change"]
[null,"Description","Code","Quantity ","Unit (person)","Quantity","Unit (e.g. month, contract, flight...)","Eligible for support up to  \nin EUR \n(price per unit) ","Total \nGIZ funding\nin EUR (up to)","Own contributions / third-party financing\nin EUR (up to) ",null,{"$f":"IF($L$6=\"VE\",CONCATENATE(\"For contract modifications:\",CHAR(10),\"Has this budget line changed?\"),\"\")","v":""},null,null,"General information: \nThis budget format is used as a basis for settlement. You may create additional files with more detailed information for your own internal use.\nAll items listed in the budget must be included in the project description to ensure that the project reference is clear. \nThe table contains formulas that must be retained.  \nPlease keep the two-decimal-place format. \nWe advise rounding up units to the nearest full unit. Costs are agreed at a value of ‘up to’. "]
[null,null,null,null,null,null,null,null,null,null,null,{"$f":"IF('Key data'!C6=\"Modification to a contract\",\"VE\",\"NOVE\")","v":"NOVE"}]
[1,"Staff\n(Note: Only direct costs for staff (monthly gross costs for the employer) may be settled. Add-ons such as staff overheads that are calculated pro-rata for staff are not eligible for support. Please indicate job functions, no names of individual persons. Staff costs are:\n\na) Prime costs for employees of the Recipient (staff employed by your organization). The evidence for this budget line must be provided in the form of payslips or, in the case of pro rata working time for the financed project,  in the form of payslips and time sheets.\n\nb) Costs for integrated consultants (self-employed or employed by a third party and seconded to the Recipient) and therefore not working on the basis of an employment contract with the Recipient, but who still work under the instructions/supervision of the Recipient, provided that this is legally permissible under the law applicable to the contract of the integrated consultant. For further requirements see Annex 3a: Requirements regarding budget and financial processing-giz.de ",null,{"$f":"IF('Key data'!C22=\"yes\",CONCATENATE(\"Tooltip:\",Example!O6),\"\")","v":""},null,null,null,null,{"$f":"SUM(I8:I44)","v":0},"\n\n\n\n\n\n\n\n\n\n\n\n\n\nThe pro-rata financing of budget lines should be avoided and applied only to personnel costs and fair-shared costs, if applicable.\n\n \nCosts that are incurred as part of the implementation of the project but are not financed by GIZ are calculated separately either as own contribution or, if applicable, as financial contribution of a third party.",null,{"$f":"IF(L6=\"VE\",\"PLEASE NOTE: GIZ cannot cover any costs that arise as a result of currency fluctuations.\",\"\")","v":""}]
[null,null,null,null,"person",null,"months",null,{"$f":"ROUND(D8*F8*H8,2)","v":0},null,null,"No change"]
[null,null,null,null,"person",null,"months",null,{"$f":"ROUND(D9*F9*H9,2)","v":0},null,null,"No change"]
[null,null,null,null,"person",null,"months",null,{"$f":"ROUND(D10*F10*H10,2)","v":0},null,null,"No change"]
[null,null,null,null,"person",null,"months",null,0,null,null,"No change"]
[null,null,null,null,"person",null,"months",null,0,null,null,"No change"]
[null,null,null,null,"person",null,"months",null,{"$f":"ROUND(D13*F13*H13,2)","v":0},null,null,"No change"]
[null,null,null,null,"person",null,"months",null,{"$f":"ROUND(D14*F14*H14,2)","v":0},null,null,"No change"]
[null,null,null,null,"person",null,"months",null,0,null,null,"No change"]
[null,null,null,null,"person",null,"months",null,{"$f":"ROUND(D16*F16*H16,2)","v":0},null,null,"No change"]
[null,null,null,null,"person",null,"months",null,0,null,null,"No change"]
[null,null,null,null,"person",null,"months",null,0,null,null,"No change"]
[null,null,null,null,"person",null,"months",null,0,null,null,"No change"]
[null,null,null,null,"person",null,"months",null,0,null,null,"No change"]
{"$rows_left_out":161}
{"sheet":"Forwarding of funds","index":2,"n_rows":153,"n_cols":14,"rows_kept":153,"cut":false,"hidden":false,"merged":[[152,1,152,9],[148,1,148,9],[150,1,150,9],[149,1,149,9],[141,3,141,7],[146,1,146,10],[125,3,125,7],[53,3,53,7],[54,3,54,7],[55,3,55,7],[56,3,56,7],[57,3,57,7],[58,3,58,7],[59,3,59,7],[60,3,60,7],[62,3,62,7],[63,3,63,7],[64,3,64,7],[65,3,65,7],[66,3,66,7],[67,3,67,7],[68,3,68,7],[69,3,69,7],[70,3,70,7],[2,0,2,9],[1,0,1,1],[1,3,1,8],[4,1,4,7],[4,8,4,9],[5,3,5,7],[5,9,140,9],[43,3,43,7],[61,3,61,7],[91,3,91,7],[108,3,108,7],[132,3,132,7],[127,4,127,6],[126,4,126,6],[128,4,128,6],[129,4,129,6],[130,4,130,6],[131,4,131,6],[82,3,82,7],[83,3,83,7],[84,3,84,7],[85,3,85,7],[86,3,86,7],[87,3,87,7],[71,3,71,7],[144,1,144,7],[142,4,142,6],[140,1,140,7],[143,1,143,7],[117,3,117,7],[118,3,118,7],[119,3,119,7],[120,3,120,7],[121,3,121,7],[122,3,122,7],[72,3,72,7],[73,3,73,7],[74,3,74,7],[75,3,75,7],[76,3,76,7],[77,3,77,7],[79,3,79,7],[80,3,80,7],[81,3,81,7],[78,3,78,7],[88,3,88,7],[89,3,89,7],[90,3,90,7],[44,3,44,7],[45,3,45,7],[46,3,46,7],[47,3,47,7],[48,3,48,7],[49,3,49,7],[50,3,50,7],[51,3,51,7],[52,3,52,7],[92,3,92,7],[93,3,93,7],[94,3,94,7],[95,3,95,7],[96,3,96,7],[97,3,97,7],[98,3,98,7],[99,3,99,7],[100,3,100,7],[101,3,101,7],[102,3,102,7],[103,3,103,7],[104,3,104,7],[105,3,105,7],[106,3,106,7],[107,3,107,7],[109,3,109,7],[110,3,110,7],[134,3,134,7],[135,3,135,7],[136,3,136,7],[137,3,137,7],[138,3,138,7],[139,3,139,7],[111,3,111,7],[112,3,112,7],[113,3,113,7],[114,3,114,7],[115,3,115,7],[116,3,116,7],[123,3,123,7],[124,3,124,7],[133,3,133,7]]}
[null,"CONFIDENTIAL"]
["Budget- Annex 1",null,null,"Name of the third-party recipient: ",null,null,null,null,null,{"$f":"'Key data'!C24","v":"00:00:00"},null,null,null,"no change"]
[{"$f":"IF(NOT(ISBLANK('Key data'!C8)),CONCATENATE(\"Agreement number: \",'Key data'!C8),\"\")","v":""},null,null,null,null,null,null,null,null,null,null,null,null,"change"]
[null,"Description","Code","Quantity","Unit (person)","Quantity","Unit (e.g. month, contract, flight...)","Eligible for support up to  \nin EUR \n(price per unit) ","Total \nGIZ funding\nin EUR (up to)","Own contributions / third-party financing\nin EUR (up to) ",null,{"$f":"IF($L$5=\"VE\",CONCATENATE(\"For contract modifications:\",CHAR(10),\"Has this budget line changed?\"),\"\")","v":""}]
[null,{"$f":"IF('Key data'!C22=\"yes\",\"Note: Blue fields to be filled in by the third-party recipient\",\"\")","v":""},null,null,null,null,null,null,{"$f":"IF('Key data'!C22=\"yes\",\" Note: calculated automatically\",\"\")","v":""},null,null,{"$f":"IF('Key data'!C6=\"Modification to a contract\",\"VE\",\"NOVE\")","v":"NOVE"}]
[1,"Staff\n(Note: Only direct costs for staff (monthly gross costs for the employer) may be settled. Add-ons such as staff overheads that are calculated pro-rata for staff are not eligible for support. Please indicate job functions, no names of individual persons. Staff costs are:\n\na) Prime costs for employees of the Recipient (staff employed by your organization). The evidence for this budget line must be provided in the form of payslips or, in the case of pro rata working time for the financed project,  in the form of payslips and time sheets.\n\nb) Costs for integrated consultants (self-employed or employed by a third party and seconded to the Recipient) and therefore not working on the basis of an employment contract with the Recipient, but who still work under the instructions/supervision of the Recipient, provided that this is legally permissible under the law applicable to the contract of the integrated consultant. For further requirements see Annex 3a: Requirements regarding budget and financial processing-giz.de ",null,{"$f":"IF('Key data'!C22=\"yes\",CONCATENATE(\"Tooltip:\",Example!O6),\"\")","v":""},null,null,null,null,{"$f":"SUM(I7:I43)","v":0},"\n\n\n\n\n\n\n\n\n\n\n\n\n\nThe pro-rata financing of budget lines should be avoided and applied only to personnel costs and fair-shared costs, if applicable.\n\n \n",null,{"$f":"IF(L5=\"VE\",\"PLEASE NOTE: GIZ cannot cover any costs that arise as a result of currency fluctuations.\",\"\")","v":""}]
[null,null,null,null,"person",null,"months",null,{"$f":"ROUND(D7*F7*H7,2)","v":0},null,null,"No change"]
[null,null,null,null,"person",null,"months",null,{"$f":"ROUND(D8*F8*H8,2)","v":0},null,null,"No change"]
[null,null,null,null,"person",null,"months",null,0,null,null,"No change"]
[null,null,null,null,"person",null,"months",null,0,null,null,"No change"]
[null,null,null,null,"person",null,"months",null,{"$f":"ROUND(D11*F11*H11,2)","v":0},null,null,"No change"]
[null,null,null,null,"person",null,"months",null,0,null,null,"No change"]
[null,null,null,null,"person",null,"months",null,0,null,null,"No change"]
[null,null,null,null,"person",null,"months",null,0,null,null,"No change"]
[null,null,null,null,"person",null,"months",null,0,null,null,"No change"]
[null,null,null,null,"person",null,"months",null,0,null,null,"No change"]
[null,null,null,null,"person",null,"months",null,0,null,null,"No change"]
[null,null,null,null,"person",null,"months",null,{"$f":"ROUND(D18*F18*H18,2)","v":0},null,null,"No change"]
[null,null,null,null,"person",null,"months",null,0,null,null,"No change"]
[null,null,null,null,"person",null,"months",null,0,null,null,"No change"]
{"$rows_left_out":134}
{"sheet":"Example","index":3,"n_rows":95,"n_cols":15,"rows_kept":95,"cut":false,"hidden":false,"merged":[[71,3,71,7],[59,3,59,7],[67,1,67,7],[64,3,64,7],[94,1,95,9],[81,1,81,7],[81,8,81,9],[87,1,88,9],[89,1,89,9],[90,1,90,9],[83,1,83,10],[60,4,60,6],[61,4,61,6],[62,4,62,6],[63,4,63,6],[68,2,68,7],[1,0,1,8],[37,3,37,7],[22,3,22,7],[4,1,4,7],[4,8,4,9],[5,3,5,7],[11,3,11,7],[5,9,67,9],[48,3,48,7],[30,3,30,7],[17,3,17,7],[18,3,18,7],[19,3,19,7],[29,3,29,7],[31,3,31,7],[32,3,32,7],[68,14,69,14],[30,14,36,14],[71,14,73,14],[76,14,78,14],[94,14,96,14],[37,14,46,14],[48,14,56,14],[59,14,62,14],[5,14,9,14],[64,14,66,14],[11,14,20,14],[22,14,29,14],[39,3,39,7],[40,3,40,7],[41,3,41,7],[42,3,42,7],[20,3,20,7],[21,3,21,7],[23,3,23,7],[24,3,24,7],[25,3,25,7],[26,3,26,7],[27,3,27,7],[28,3,28,7],[43,3,43,7],[44,3,44,7],[45,3,45,7],[46,3,46,7],[47,3,47,7],[70,1,70,7],[69,4,69,6],[49,3,49,7],[50,3,50,7],[51,3,51,7],[52,3,52,7],[53,3,53,7],[54,3,54,7],[55,3,55,7],[56,3,56,7],[57,3,57,7],[58,3,58,7],[65,3,65,7],[66,3,66,7],[75,1,75,7],[76,3,76,7],[72,3,72,7],[73,3,73,7],[74,3,74,7],[79,3,79,6],[80,3,80,6],[92,1,92,9],[77,3,77,6],[78,3,78,6],[85,1,85,9],[12,3,12,7],[13,3,13,7],[14,3,14,7],[15,3,15,7],[16,3,16,7],[33,3,33,7],[34,3,34,7],[35,3,35,7],[36,3,36,7],[38,3,38,7]]}
[null,"CONFIDENTIAL"]
["Budget – Annex 1",null,null,null,null,null,null,null,null,{"$f":"'Key data'!C35","v":"00:00:00"},null,null,null,null,"Instructions:\nThis is merely intended to provide guidance in filling out the ‘Financing budget’ tab. "]
[]
[null,"Description","Code","Quantity ","Unit (person)","Quantity","Unit (e.g. month, contract, flight...)","Eligible for support up to  \nin EUR \n(price per unit) ","Total \nGIZ contribution\nin EUR (up to)","Own contributions / third-party financing\nin EUR (up to) ",null,null,null,null,"General information: \nThis budget format is used as a basis for settlement. You may create additional files with more detailed information for your own internal use.\nAll items listed in the budget must be included in the project description to ensure that the project reference is clear. \nThe table contains formulas that must be retained.  \nPlease keep the two-decimal-place format. \nWe advise rounding up units to the nearest full unit. Costs are agreed at a value of ‘up to’. "]
[null,"Note: Blue fields to be filled in by the recipient",null,null,null,null,null,null,"Note: calculated automatically",null,null,null,null,null,"Notes on filling out the table"]
[1,"Staff \n(Note: Only direct costs for staff (monthly gross costs for the employer) may be settled. Add-ons such as staff overheads that are calculated pro-rata for staff are not eligible for support. Please indicate job functions, no names of individual persons. Staff costs are:\n\na) Prime costs for employees of the Recipient (staff employed by your organization). The evidence for this budget line must be provided in the form of payslips or, in the case of pro rata working time for the financed project,  in the form of payslips and time sheets.\n\nb) Costs for integrated consultants (self-employed or employed by a third party and seconded to the Recipient) and therefore not working on the basis of an employment contract with the Recipient, but who still work under the instructions/supervision of the Recipient, provided that this is legally permissible under the law applicable to the contract of the integrated consultant. For further requirements see Annex 3a: Requirements regarding budget and financial processing-giz.de ",null,"",null,null,null,null,{"$f":"SUM(I7:I11)","v":94000},"\n\n\n\n\n\n\n\n\n\n\n\n\n\nThe pro-rata financing of budget lines should be avoided and applied only to personnel costs and fair-shared costs, if applicable.\n\nCosts that are incurred as part of the implementation of the project but are not financed by GIZ are calculated separately either as own contribution or, if applicable, as financial contribution of a third party.",null,null,null,null,"The column \"Eligible for support up to\" should always indicate the monthly gross employer salary. Please state in column D the percentage that GIZ should finance. Statutory employee-related costs incurred under the respective employment contract law may be taken into account. As a general rule, social contributions are eligible for funding, as are payments that have been agreed in an employment contract or under a collective bargaining agreement (with the exception of bonus and profit-sharing payments). Any ancillary costs that do not fall under this category must be discussed and agreed, reviewed and noted in the budget line before the contract is prepared. Contracts for ‘mini-jobs’ or for students on temporary work are to be allocated to staff costs, even if no social contributions are incurred in this context.                                                                                                                                                                                   If funding is to be provided for several people on a pro-rata basis (e.g. three people working 75%), please increase the number of months as required and enter the number of people in the budget line description."]
[null,"Project manager",null,1,"person",20,"months",3000,{"$f":"D7*F7*H7","v":60000}]
[null,"Financial manager ",null,0.5,"person",20,"months",2200,{"$f":"D8*F8*H8","v":22000}]
[null,"Severance payments / statutory accruals ",null,1,"person",20,"months",600,12000]
[null,null,null,null,"person",null,"months",null,0]
[null,null,null,null,"person",null,"months",null,0]
[2,"External services (type/content of service)\n",null,"",null,null,null,null,{"$f":"SUM(I13:I22)","v":7000},null,null,null,null,null,"Enter the function title; no contract details (e.g. working hours); only state the planned value (the relevant guidelines governing contracts awards must be observed!); one budget line should be used for each service type; (all costs such as training, business trips incurred as part of service delivery under a service contract are displayed in one budget line).                                                                                                                                                                                                              Events: Services provided by the same provider should be displayed in one budget line. (e.g.: if a hotel provides both catering and the venue, these costs belong in a single budget line; if another hotel is booked for accommodation, then these costs belong in a separate line).\nAny items for which the recipient receives income when running the event cannot be financed under the contract (e.g. rental for rooms on own premises). Funding can only be provided for costs for which evidence can actually be provided."]
[null,"Moderation services",null,"Contract/Contracts",null,null,null,null,5000]
[null,"Catering and room rental",null,"Contract/Contracts",null,null,null,null,2000]
[null,"Solar technology expert",null,"Contract/Contracts",null,null,null,null,{"$f":"ROUND(H15,2)","v":0}]
[null,"Expert for…",null,"Contract/Contracts",null,null,null,null,0]
[null,"External workers (not in an employment relationship with recipient that is subject to social insurance contributions)",null,"Contract/Contracts",null,null,null,null,0]
[null,"Consultancy assignments",null,"Contract/Contracts",null,null,null,null,0]
[null,"External companies, e.g. for bus transport",null,"Contract/Contracts",null,null,null,null,0]
[null,null,null,"Contract/Contracts",null,null,null,null,0]
{"$rows_left_out":75}